Home

August 22, 2022

TS1609 Bonjour service failed to start, verify you have sufficient privileges” error message when installing
TA43161 Cannot Write to Hyphenation Dictionary” Error
TA42510 Could Not Configure Connection Tool” Error Message (CM)
TA43447 Device Not Functioning” Error When Installing ClarisWorks 4.0
TA43188 Error Decompressing” Messages During Installation
TA43918 File Server Uses Incompatible Version of the AFP Protocol” Error Resolution
TA42970 Insufficient Memory” Error Message During Installation
TA36253 Macintosh 5400, 6400, & 6360: -23 Error When Printing (3/97)”
TA46648 Macintosh: Error -39”“End Of File”” Meaning
TA42738 Not Enough Chart Data” or Chart Error After Moving Table Cells
TA42739 Not Enough Memory to Display PICT Preview” Error Message
TA42409 Not Enough Memory to Run Application” Error Message
TA43694 Not Enough Space on the disk” error in ClarisWorks with Gateway Machine Running Windows NT 4.0 on a 2gb+ Drive
TA43158 Out of Disk Space” Error When Installing ClarisWorks 3.0 For Windows
TA42432 Sorry, that area is too complicated” Error Message (PT)
TA42995 Unable to Quit…” Error Message
TA33048 (Lisa)Mac XL : LisaTest V.2.2 - Error 3 in Step 7
TA43056 -40 Error Opening WinWord 2.0 Files Saved From WinWord 6.0
86146-ja .Mac Backup:「内部システムのエラーが起こりました」警告メッセージ
86245-ja .Mac Backup「内部システムのエラーが起こりました」の警告
TA24447 .Mac: システム状況に、断続的なメール送信エラーが発生することがあると掲載されています
302030-ja .Mac: メール送信時の認証エラー
TA33199 512K Macintosh 800K External Drive P/C: Sad Mac error 0F0004.
TA40162 A/UX 1.1: Solution for loop:bad value” Error
TA46938 A/UX 2.0.1: Solution for syschk” Error Problem
TA44143 A/UX 2.0: panic(vbwrite) Error
TA29271 A/UX 3.0 and Password Entry Error (4/93)
TA47035 A/UX 3.0: Root File System Is Full” Error Workaround (3/95)
TA28001 A/UX 3.0: scn_open request for write” Error & Wrkaround (6/96)
TA28974 A/UX 3.0: libPW.a and Missing Error Symbol (2/93)
TA33527 A/UX Error: Cannot Mount Drive, Dirty File System (3/95)
TA32586 A/UX or AWS 95: File System Full, Error Recovery (11/96)
TA44814 A/UX: /etc/newunix: /etc/uninstall.d/ae6: not found” Error
TA44815 A/UX: /etc/newunix: /etc/uninstall.d/toolbox: not found” Error
TA44819 A/UX: Initiate single-user mode, unknown id root” Error
TA28609 A/UX: bad sblock magic number” Error When Backing Up
TA47505 A/UX: can’t create lower memory segment” Error (9/94)
TA40649 A/UX: cpio” and Floppy Disk Error (2/95)
TA40099 A/UX: AppleTalk Interface Script Error (8/94)
TA44818 A/UX: Autoconfig Cannot Find Drivers Error
TA40860 A/UX: Big C Compiler Error Message–“too many defines”
TA45063 A/UX: Diagnostics for a ping” Error
TA47579 A/UX: Ethernet ae0 transmitter frozen” Errors (9/94)
TA44121 A/UX: Ethernet Input Errors (9/94)
TA40638 A/UX: Fix for POSSIBLE FILE SIZE ERROR I=xxx Error”
TA40311 A/UX: LaserWriter IINTX Connection Documentation Error
TA28126 A/UX: MacWrite II, Temp File, and File is Locked” Error
TA40846 A/UX: Shared Memory Error Message (9/94)
TA44880 A/UX: Solution to /etc/fstab: No such file or directory” Error
TA44899 A/UX: Solution to /etc/mtab: No such file or directory” Error
TA45045 A/UX: Solution to RPC_MAP_FAILURE” Error
TA44871 A/UX: Solution to RPC_PROG_NOT_REGISTERD” Error
TA44874 A/UX: Solution to network unreachable” Error
TA39884 A/UX: Some Error Messages Explained (8/94)
TA45061 A/UX: The network unreachable” Remote Mount Error (8/94)
TA28853 A/UX: VT102 Man Page Error
TA45013 A/UX: ae0 Interrupt Errors
TA30960 ABS Tech Note: ARA02 Error Correction & Modem Scripts (11/94)
TA31975 ABS Tech Note: AWS22 Retrospect Error Codes (3/95)
TA30079 ABS Tech Note: DAL30 Error Inserting Date With Select
TA37525 ARA 3.0: Errors Enabling Answering With IP Dial-In
TA38175 ARA: Error -43
TA31437 ARA: Error in Port Configuration w/X.25 Extension
TA31720 AWS 95: Retrospect Backup Error -24702, Name Too Long (6/94)
TA31891 AWS 95: Retrospect Memory Error -108, Application Memory
TA32680 AWS 95: Run Level Error When Booting A/UX
TA29636 Access II: Volume Not Found” error
TA38581 Acrobat Reader 3.01: PostScript Error typecheck” When Printing
TA29628 Adjustable Keyboard Driver: Installation Error
TA21459 AirMac 3.4:「選択された AirMac ネットワークに接続する際のエラー」
TA25956 AirMac Base Station: インターネットアプリケーションのタイムアウトエラーについて
58542-ja AirMac Card: AirMac カードの“必要なソフトウェアが見つからない”エラーについて
TS2278 AirMac Express ベースステーションにストリーミングを行うと“-3256”または“-15000”エラー
TA21550 AirPort Express: Bad param error -4” when administering from a Windows computer
TA32026 American Heritage Dictionary: Error Type -250 (3/97)
TS1488 Aperture 2: Print queue error when printing to Epson Roll Printer
TA23617 Aperture: Rename Error” when naming an album, book, web journal, or web gallery
TA25079 Aperture: Applescript to access Aperture library generates an error under Leopard
TA24403 Aperture: Compatibility Checker gives error for unsupported graphics card
TA24432 Aperture: イメージを読み込むと“ディスク容量が不足”エラーが表示される
TA23717 Aperture: イメージ読み込み時の“Couldn’t Create”エラー
TA23745 Aperture: ディスクエラーでボールトから復元できない
TA23667 Aperture: 同時読み込み時の“読み込みエラー”メッセージ
TA29872 Apple Backup: Type 1 Error (8/93)
TA30448 Apple Color OneScanner: LED Error Flashes Twice (10/93)
TA22163 Apple DVD Player: Error 301
TA26038 Apple DVD Player: 最初に起動した際に起きるタイプ 1 またはタイプ 2 エラー
TA22069 Apple DVD Player:「ディスクに汚れやキズがついている」のエラーメッセージ
TA26384 Apple DVD Video Player: エラー番号“-9845”のため再生できない
TA29420 Apple Early Learning Connections: Grady Profile Error T106
TA30657 Apple File Exchange: Users Guide Error (12/93)
TA44763 Apple GS/OS Error Messages: Where to Find Explanations
TA39836 Apple HD Backup Error: Tried To Open Too Many Files”
TA46412 Apple II Plus: Relocation/Configuration Error (2/97)
TA36547 Apple IIGS Errors: Toolset numbers
TA47099 Apple IIGS: AppleTalk must be installed” Error
TA46611 Apple IIGS: $8002 Error
TA45905 Apple IIGS: Error 0C Indicates Sound Chip Problem
TA40192 Apple IIGS: Error 911 Is Too Many Sync Errors on ADB
TA36747 Apple IIGS: Error in Show Text File Desktop Accessory
TA36967 Apple IIGS: System Diagnostic Errors
TA46699 Apple IIGS: System Error 0027 — “File Map Destroyed”
TA47190 Apple III: SOS Error 90
TA32241 Apple III: System Failure Errors
TA32914 Apple IIc Upgraded Motherboards: Diagnostics Error
TA34649 Apple IIc: Data Errors When Sending to Serial Device
TA28884 Apple IIe Card: A/ROSE Causing Error Running IIe Startup (1/95)
TA46465 Apple IIe Card: ProDOS 1.9. Corrects AppleWorks Date Errors
TA33351 Apple IP Gateway: -344 Error (6/96)
TA35675 Apple Media Tool: Not Enough Internal Memory Error
TA25269 Apple Remote Access: Error -7117” was Detected
TA32644 Apple Remote Access: Error Codes
TA33195 Apple Remote Access: PowerBook Duo 230 and Error -23
51821-ja Apple Remote Desktop 1.0: Communication Error
51824-ja Apple Remote Desktop 1.0: File Transfer Error
TA28438 Apple Remote Desktop 1.2: 複数システムの監視中に「通信エラー」が現れたときのクライアントの状況が正しくない
TA32020 Apple Restore: Disk or Disk Drive error (6/94)
TA31584 Apple Shared Library Manager: Errors And Resolution
50910-ja Apple Studio Display (15-inch VGA/LCD): An Error Has Occurred Reading From or Writing to a File
TA21783 Apple Studio Display 15” LCD: PC Compatibility Card Error Message
TA38795 Apple Studio Display 15-Inch LCD: AppleVision Error Under Mac OS 8.5.1
TA35042 Apple Video Player: Errors When Freezing or Copying Image 1/96
TA29476 Apple Workgroup Server 95: System error -54
TA48252 AppleColor High-Res RGB Monitor: Voltage Range Label Error
TA36906 AppleFax: Error When Changing Number of Retries
TA37069 AppleScript 1.1: Error With More Than 512MB RAM
TA30979 AppleScript Scripter’s Toolkit: Error on Box
TA33277 AppleScript: Script Editor Error Source Not Available”
TA46367 AppleShare & Apple IIGS: Cannot Load Descriptor File” Error
TA33637 AppleShare 3.0.1 and System Error -35 (4/95)
TA28060 AppleShare 3.0: Improper ProDOS Pathname Error
TA30978 AppleShare 4.0 Print Server: Not Printing Error Pages
TA39314 AppleShare Error: System Error ID=29
TA38820 AppleShare IP 6.1: Error -29626 in Web & File Admin
TA25299 AppleShare IP 6.2: アクセス権が無いためにファイルがコピーできないエラーについて
50870-ja AppleShare IP 6.3.3: How to Edit Web Error Messages
50749-ja AppleShare IP 6.3.3: How to View Mail Server and Error Logs
TA20664 AppleShare IP 6.3: Error -43” Alert
TA38668 AppleShare IP Web & File Admin: 起動時のエラー
30732-ja AppleShare IP: LPD Errors Chart
TA39825 AppleShare Network Server 2.0.1: Installation & Error Message
TA46637 AppleShare Print Server: Stack underflow” Is PostScript Error
TA47363 AppleShare Print Server: -120 Error
TA47859 AppleShare Print Server: Error -120 Is directory not found”
TA40518 AppleShare Print Server: Error Code -127 Problem Solved
TA30115 AppleShare Print Server: Prevent Error Page Printing
TA28598 AppleShare: Access Error on Workstations Using System 6.0.5
TA37744 AppleShare: Documentation Error About Server’s RAM Cache Setting
TA46843 AppleShare: Finder Copying Causes ID=1 Errors
TA35340 AppleShare: Some Information Not Found Error Message
TA36973 AppleSoft: INPUT Statement Documentation Error
TA44936 AppleTalk for VMS 2.0.6: Fixes Error Message Issues
TA35357 AppleTalk: Cannot Be Opened Error Message
TA46101 AppleTalk: System Errors and Third-Party Software
TA22056 AppleWorks 5.x: Error Printing Fax Cover Sheet 3
TA22092 AppleWorks 5: The file QuickHelp” couldn’t be found’ Error
TA22067 AppleWorks 5: Equation Editor Symbol Font Error
TA20648 AppleWorks 6 (Windows): An unexpected error has occurred, #-38” Message
TA25394 AppleWorks 6: 数式エディタで Symbol フォントエラー
88004-ja AppleWorks 6: 白黒モードでの印刷エラー
TA22151 AppleWorks 6:「メインのスペル辞書がインストールされていない」エラーメッセージ
TA29576 AppleWorks: Some cells lost in row….” error
TA25264 AppleWorks: Disk is Full’ Error When Saving to Windows Server
TA25374 AppleWorks: AppleWorks 6 Updater Log Error
TA25268 AppleWorks: Locked File Error When Installing
TA45306 Applesoft: Cassette Tape Loading Errors
TA45025 Applesoft: OUT OF MEMORY Errors
TA44864 Applesoft: OVERFLOW ERROR in first line of program
TA44056 Applesoft: Syntax error when the program is run
TA28422 Applesoft: Syntax errors after CTRL-S
TA48226 Applesoft: Tips on error handling
TA46225 Aristotle: error occurred in your user folder” Message
TA30614 Asynchronous DataComm: Stop Bits and Framing Errors
TA36323 At Ease 4.0: -5000” Error When Launching CD-ROM Discs (12/96)
TA36228 At Ease Administration: Error While Editing Workgroup
TA38866 At Ease: The Scrapbook and file doesn’t exist” error
TA37091 Avid Cinema: Digitizer Can’t Load” Error (6/97)
TA37089 Avid Cinema: Unexpected Error Occurred” And QuickTime (6/97)
TA37111 Avid Cinema: Error In Tutorial (6/97)
TA37124 Avid Cinema: Errors When Recording At 256 Colors
TA43205 Avoiding This copy is busy. Please try again Later.” error when launching ClarisWorks
TA32746 Bailey’s Book House: Error Message After Printing
TA24030 Bonjour for Windows: Error -995 when repairing software in Spanish
TS2463 Boot Camp: Microsoft Vista (SP1) Windows Auto Update error report
TA43953 Business BASIC III: Error codes not in the manual
TA47449 Business Basic III: VARIABLE ERROR in version 1.1 and earlier
TA31346 CD Sampler.BW Gives an Error in HyperCard (3/94)
TA39495 CD error after installing MacOS 7.6
TA38848 CSW 2400/2500: Cartridge Not Installed Properly or Missing Error
TA33641 Calculator: Small Errors in Calculations (4/95)
TA35494 Calendars and More: Disk Error Message (5/96)
TA42380 Chaining Macros with Function Keys Error
51788-ja Cinema Tools For FCP: カットリストにテンポラリファイルについてのエラーが表示される
51786-ja Cinema Tools For FCP: リバーステレシネ機能を使用したときのフレーム落ちエラー
TA42086 Claris Application: File is Locked or Disk is Full Error Message
TA41422 Claris CAD: Out of Memory” errors
TA41165 Claris CAD: Crashing With System Error (ID=15)
TA41427 Claris CAD: Documentation / Publications Error
TA41247 Claris CAD: Error ID=12
TA41255 Claris CAD: Error: Limitcheck; OfgCmnd: Framedevice
TA41745 Claris CAD: LimitCheck Error
TA43083 Claris Organizer: System Error 28 when Editing Fax Covers Layout (68000 Only)
TA41887 Claris Resolve: ATIME Documentation Error
TA41719 Claris Resolve: ArrowLength, Documentation / Publications Error
TA41966 Claris Resolve: Cell Function Documentation Error
TA41879 Claris Resolve: Documentation Error
TA41739 Claris Resolve: Error Message Invalid Command”
TA41967 Claris Resolve: Executing Custom Function Documentation Error
TA41686 Claris Resolve: Minimum System Require - Document / Publications Error
TA42067 Claris Resolve: Regression Analysis Documentation Error
TA41681 Claris Resolve: Selecting Polylines–Documentation Error
TA43350 Claris Works: Error in Calculation That References a Pop-up Menu (Value List)
TA42961 ClarisDraw: ATM Error Codes Converting Text to Bezigons
TA43122 ClarisImpact: Documentation Error - Table Cell Backgrounds
TA43062 ClarisImpact: Documentation Error Notes
TA42763 ClarisImpact: Documentation Error on Connectors: UG Page 1-18
55687-ja ClarisImpact: Documentation Error, Page 2-21 of User’s Guide
TA42764 ClarisImpact: Error in Help System - Linking Text Frames
TA43411 ClarisImpact: PostScript Errors When Printing May be Due to the Number of Fonts
TA43060 ClarisImpact: STR 128 Error with Updater
TA42827 ClarisImpact: Table of Contents Errors in ClarisArt Book
TA41859 ClarisWorks 1.0: Var() Returning Negative Number or StDev() Returning #NUM! Error (SS,DB)
TA43091 ClarisWorks 2.1v3: Error Messages When Updating with 2.1v4 Updater
TA21793 ClarisWorks 5.0 for Windows Updater: Installer Error
TA42641 ClarisWorks SS: Decreasing Rows and Columns in the Document Error Message
TA43506 ClarisWorks for Windows: Internal Spelling Error SPL01 When Spell Checking
TA41842 ClarisWorks, Impact: Calculated Cells Showing Round-Off Errors
TA43399 ClarisWorks: CALL TO UNDEFINED DYNALINK Error
TA43238 ClarisWorks: No Terminal Tools Available” Error
TA42789 ClarisWorks: Can’t Access the Error Correction Settings in Apple Modem Tool Dialog (CM)
TA43646 ClarisWorks: DOS 21 Error when Using Win32s Based Applications
TA41803 ClarisWorks: Error -50 Opening Files While Using Empower or FileGuard
TA41862 ClarisWorks: Error Message …outside the document boundaries…”
TA43104 ClarisWorks: Error in Mortgage Maker Template
TA42186 ClarisWorks: Error in Third Party Book Using ClarisWorks”
TA42140 ClarisWorks: Page Number Errors in Getting Started Index
TA42101 ClarisWorks: Ruler Error
TA42084 ClarisWorks: StyleWriter Print Error Message
TA29319 Color Classic: Apple File Exchange Error Message (8/93)
TA33924 Color LaserWriter 12/600 PS: Fuser Oil Pump Error
TA34216 Color LaserWriter 12/600 PS: System Error at Address 0x132460
TA35750 Color LaserWriter 12/600: Error 0x3e7750 with AppleShare
TA34454 Color LaserWriter 12/600: Postscript Errors
TA35660 Color LaserWriter 12/600PS: Moving Precautions and Errors
TA35761 Color OneScanner 600/27: エラーメッセージのトラブルシューティング (7/96)
TA33174 Color StyleWriter 1500, 2400 & 2500: Waste Ink Absorbers Full Error
TA33560 Color StyleWriter 2400: Printer Port In Use Error (9/95)
51097-ja Color StyleWriter 2500 Printer: The Error Light Blinks
TA25381 Color StyleWriter 4000 Series: Error When Using ColorSync 3.x Color Matching
TA38159 Color StyleWriter 6500: Minimal Install Colorsync Error
TA32229 Color StyleWriter Pro: Error Due to Amount of RAM (1/95)
TA31239 Color StyleWriter Pro: Meaning of Error LEDs
51390-ja Color StyleWriter Pro: The Computer Tells You There is an Error in the Printer
51307-ja Color StyleWriter: The Printer Detects an End-of-Paper Error
51306-ja Color StyleWriter: There is An Error in the Printer
HT2433 Common System Error Messages: 一般的なシステムエラーメッセージの意味と問題の解決方法について
TS2153 Compressor:1 GB 未満の RAM を備えた HD/HDV からエンコーディングするとエラー 0 が発生する
TA29016 DAL Server for AS/400: Majorcode=5 & Minorcode=6 Errors
TA30886 DAL/VMS 1.4-Invalid Username/Psswd Error, ADSP Connect (12/93)
TA47260 DAL: Error Message 10632
TA45985 DAL: How It Checks Communication Lines for Errors
TA46988 DAL: Out-of-memory Error Due to Application’s List of Tables
TA28790 DAL: VTAM and Teradata Database Error Messages
TA43138 DOS 3.3: Not Direct Command” Error
TA31755 DOS Compatibility Card: Cause of Diskette Error Message (5/94)
TA33431 DOS Compatibility Card: DOS SCSI Drive Retry Error (3/95)
TA33124 DOS Compatibility Card: PC Network Extension Error Message 8/95
TA33317 DOS Compatibility Card: VTCPIP Error w/ Windows
TA36070 DOS/PC Compat Card: Error 171 When Installing Windows 95 (10/96)
TA26462 DVD Player 3.0: コンピュータにスピーカが接続されていない場合のエラー -70027
TA26451 DVD Player 3.0: スリープ復帰時に「DVDManager Fatal Error -36」エラーメッセージが表示される
TA26910 DVD Player: DVD Player encountered a serious error” Alert
TA38992 DVD Studio Pro 1.0.1:「DDVID.DAT not found(DDVID.DAT がみつかりません)」エラー
51798-ja DVD Studio Pro 1.5: Found VOBU Error
TA47734 DVD Studio Pro 2: Break Point Not Found” Error on French Systems
TA27683 DVD Studio Pro 2:「MUXER_INTERNAL_ERROR」警告メッセージ
TA23676 DVD Studio Pro 4: DLT ドライブへの書き込み時の「空き領域不足」エラー
TA23959 DVD Studio Pro 4: H.264 を使った HD DVD プロジェクトで“フォーマットに失敗しました”エラーや“多重化処理のビットレートが高すぎます”エラーが表示される
TA38394 Desktop Printing: Error -192 at 18” at Startup
TA26240 Desktop Printing: Error -8940
TA25712 Disk Copy 6.3: -50 Error When Making Image
TA43286 Disk Error Messages During Installation
TA25312 Disk First Aid: HFS Wrapper Partition Damaged”(HFS ラッパーパーティションが破損している)エラー
TA21624 Disk First Aid: Invalid PEOF Error
TA21594 Disk First Aid: What to do when it finds an error
TA38265 Disk Images: - 50 Error Message
TA27188 Disk Utility: Error -9977 when setting up hard drives as members of an AppleRAID set
TA36174 Dispatcher Software: Type 11 Error with HP DeskWriter (3/97)
TA43335 Documentation Error: Help System
TA42893 Documentation Error: Page 2-13
TA37430 Drive Setup: Test Disk Sector Sparing and Error Messages
TA25850 Dutch iMac Restore CD: Error When Trying to Restore
TA27175 ECC メモリエラーについて
TA36048 Education Software Bundles: Adobe Type Manager Error (9/96)
TA36047 Education Software Bundles: Spelling Coach Pro Error (9/96)
TA36100 Energy Saver 2.0.2: Error Message on Startup
TA42293 Error (-47) While Installing Communications Tools On A PowerBook or on a Quadra 660AV/840 AV With an Apple GeoPort Adapter (CM)
TA38678 Error -18 message when restoring iPhone in iTunes
TA24756 Error -3234 when trying to update or restore iPod or connecting to the iTunes Store
TA38662 Error -48 when restoring iPhone in iTunes
TA42619 Error Message Cannot Modify a Non-Modifiable Subscriber” (SS)
TA42490 Error Message Cannot Start More Than One Copy of Application”
TA43636 Error Message: A script error has occurred. There may be not enough memory to launch the application, or it may have a dialog up.”
TA43175 Error When Creating Database Document
TA43392 Error in ClarisImpact Windows Installation Guide
TA42927 Error in Weekly Planner Template from ClarisWorks Home Pack Templates (SS)
TA43475 Error message : Sorry the ASCII translator is not responding properly”
TS1060 Error message when opening a Keynote presentation in Mac OS X 10.5 Leopard
TA43627 Error message: This is not a ClarisWorks file or has been corrupted.
TA43422 Error when Connecting to the Claris FTP Server
TA43726 Error when Connecting: Could not resolve the domain name because no data was available for reading”
TA43583 Error: Can’t open temporary file, do you own it?”
TA32640 Ethernet: Could Not Switch to EtherTalk” Error
TA32373 Express Modem: Ver. 1.5.3 Fixes Cannot be Used…” Error
TA34281 Extended 80-Column Text Card: Sample Program Error (11/96)
TA36781 FORTRAN: Understanding Code Write Error”
TA35770 Fax Terminal: Will Not Open, Gives Type 1 Error
TA34856 Fax Viewer & Type 11 Error: Printing to StyleWriter (2/96)
TA25771 FaxSTF: ANAT または Network Assistant インストール後のエラーに関するトラブルシューティング
TA42190 FileMaker Pro: Postscript Error when Printing EPSF Graphic
TS2118 Final Cut Express HD 3.0: iMac G5 (iSight) および Power Mac G5 (Late 2005) で使用すると設定エラーが生じる
TA22727 Final Cut Express で RAM が 384 MB より少ないと「機器構成エラー」警告が表示される
TA44498 Final Cut Pro 2: Error Importing EDL Message With Sony 9100 Format EDLs
TA27404 Final Cut Pro 3: Access Denied Error During Installation
TA26487 Final Cut Pro 3: チュートリアル実行中の「General Error 34(一般的なエラー 34)」
TA44703 Final Cut Pro 3:「特定の取込み先ボリュームでエラーが起こりました」警告メッセージ
TA27482 Final Cut Pro 4, Soundtrack: アプリケーションを起動するときの「-4960 エラー」
TA27550 Final Cut Pro 4.1: Out of Memory” Error With Less Than 384 MB of RAM
TA27552 Final Cut Pro 4: Error when opening a project on a different computer
TA27571 Final Cut Pro 4: 一般的なエラーが表示されキャンバスウインドウが赤くなる
TA24854 Final Cut Pro 6.0.1: H.264 playback in Viewer results in General Error”
TA22112 Final Cut Pro: Out of Memory Errors” When Exporting EDL Files
TA24606 Final Cut Pro: Codec error when exporting as H.264
TA24857 Final Cut Pro: Error 12 message when performing Media Manager operation on clip with long file name
TA23028 Final Cut Pro: File error when exporting clips to Soundtrack
TA27542 Final Cut Pro: General Error When iChat Is Open
TA24254 Final Cut Pro: Timecode Error when capturing from Canon XL H1
TA37630 Final Cut Pro: Timecode Errors During Capture
24972-ja Final Cut Pro: キャプチャ中のタイムコードエラー
TA22143 Final Cut Pro: タイムコードエラーを解決する
25101-ja Final Cut Pro: バッチ取り込み時に EDL 取込みで起きる「同じファイル名がある」エラー
TA23714 Final Cut Pro: レンダリングの実行中のファイルの使用中エラー
TS2117 Final Cut Pro:“Soundtrack Pro への送信エラー
TA23922 Final Cut Pro:“ファイルエラー:同じ名前のファイルがすでに存在します。”
TA44009 Final Cut Pro:「サーボがロックできない」エラーメッセージの説明
TS2409 Final Cut Pro:一部のプロジェクトを開いた際に「AE Effects エラー:プラグインが見つかりません」という警告が表示される
TA22500 Finder や iTunes で、ディスク作成時に「バッファアンダーラン」エラーが表示される
TA37646 Font First Aid : 検証中にエラーが発生する
TS1697 FxPlug SDK: Build errors after installing Final Cut Express
TA41072 GS/OS 5.0.2: File Not Found” Error
TA39106 GS/OS: Correction To Formatting Options Error In The Manual
TA40553 GS/OS: SCSI Device Driver Error Message
TA39735 GVC Platinum Modem: Error Correction & Data Compression
TA36290 GVC Platinum Modem: Error Correction & Data Compression (12/96)
TS2174 GarageBand 3: ムービーの読み込み時にオーディオがないことを示すエラーが表示される
TS1215 GarageBand: Disk too slow” error message sometimes occurs when recording to external drive
TS1519 GarageBand: 「エラーコード 2 が CoreAudio ドライバによって返されました」
TA27651 GarageBand:「CoreAudio ドライバのコード 727 のエラーが発生しました」メッセージ
TA27582 GarageBand:「オーディオと MIDI の同期中のエラー」
TS2177 GarageBand:曲を読み込むと、「Core Audio Plug-in EXS24… not available」というエラーメッセージが表示される
TA43599 Getting the Out of Hard Drive Space Error Message when Trying to Install FileMaker Pro 3.0 , ClarisWorks 3.0 or ClarisWorks 4.0 in Windows 95.
TA35994 Global Village Modems:Faxing from Office 4.2.1 Apps & Type 3 Error
TA39754 GlobalFax: Common Errors
TA40865 Graphics Tablet: Area Calculation Errors (11/96)
TA34963 Grolier’s Encyclopedia: Errors and Lockups When Searching (1/96)
TA43467 Growstub Error
TA29285 HP Deskwriter C: Out of Memory Error (4/93)
TA22775 Helvetica フォントを無効にした状態でチャットを開始すると iChat に「内部エラー (Internal Error)」が表示される
TA31105 HyperCard 1.2.5: Error Converting Month Calendar
TA31099 HyperCard 2.0v2 Graph Maker: Fix for Business Chart Error (7/92)
TA31110 HyperCard 2.0v2: Never heard of…” Error (7/92)
TA30674 HyperCard 2.0v2: Divide by Zero Error Fixed in 2.1 (7/92)
TA29296 HyperCard 2.1 Player: Error t63 (4/93)
TA31091 HyperCard 2.1: Send Message” Error (10/92)
TA31090 HyperCard 2.1: String Too Long Error (10/92)
TA33992 HyperCard 2.3: Errors in Documentation (9/95)
TA33741 HyperCard 2.3: Manual Error Wrong Instructions On Pg 137 (5/95)
TA37954 HyperCard 2.x, HyperCard Player: Error Code List (12/93)
TA30767 HyperCard Player: Out of Memory Error or Window Resize (9/93)
TA44130 HyperCard: closeCard” Error Fixed in 2.0 (11/94)
TA38357 HyperCard: Disk Full Error
TA39146 HyperCard: Error -199” May Be Map Resource Problem
TA40580 HyperCard: Error 1277
TA39955 HyperCard: Error Code 19374
TA40121 HyperCard: How to Debug Too Much Recursion” Error Message
TA30858 HyperCard: No Error Messages from Palette Buttons (7/92)
TA35538 HyperCard: Problem with Type 3 Error Opening Power Tools (5/96)
TA43643 Illegal Operation Error in Module COMCTL32.DLL when Switching into Edit Page Mode from Preview Page Mode
TA32235 ImageWriter II: Loopback Test Failed” error
TA42463 Installation to a Novell server sometimes gives an Invalid Path error (All)
TA34969 Installer & Problem With Disk” Error Message (7/96)
HT2341 Intel ベースの Mac において起動時のセルフテストで表示される RAM エラーコード
HT2674 Intel-based Mac: 起動順序とエラーコード(記号)
TA45053 Internet Router & 6.0.7: Coprocessor not installed” error
TA33962 Internet Server For WWW: Errors in Documentation
TA36040 Japanese Language Kit: WordPerfect Document Error
TA42525 Keyboard Shortcut Error in French ClarisWorks
TA47721 Keynote 1.1.1: About the MS Comic Sans Error” Message
TS2172 Keynote 2.0.1: QuickTime へのエクスポート時に「ディスクの空きが足りない」エラーが表示される
TA37174 KidWorks Deluxe, Spell It, Spell It Deluxe: -35 Error During Install
TA36456 LW 8.4.x: Type 11 Error When Setup Used With ATM 4.0 (2/97)
TA31245 Language Kits: Printing Errors Q & A
TA34450 LaserShare 1.0: Error Can Result From Changing Long Spooler Name
TA38221 LaserWriter 12/640 or 12/600: LaserWriter and -2804 Errors
TA38495 LaserWriter 12/640: Error -2804
51522-ja LaserWriter 4/600 PS: The Printer Jams or Reports a Wrong Paper Size Error
TA36417 LaserWriter 8.4.x: Type 15 Errors With Desktop Printing (1/97)
TA35961 LaserWriter 8.4: Corrupt Prefs Can Cause Errors
TA38523 LaserWriter 8.5.1: -192 or -8993 Errors Through Print Server
TA38785 LaserWriter 8.6: HP LaserJet Reporting 40 MIO ERROR
TA30904 LaserWriter 810 & 360: Fax Option Error Checking
TA38466 LaserWriter 8500: Fuser Cover Open Error
TA38377 LaserWriter 8500: Paper Out and Paper Jam Error Lights Flashing
TA38376 LaserWriter 8500: User Manual Error, Connecting PC Section
TA29547 LaserWriter Driver 8.0: A4 errors in LaserWriter PPD (6/93)
TA33716 LaserWriter Fax: Reducing VMerrors Sending to Lrg Groups
TA40055 LaserWriter IINT/NTX: COM1:” Port Error in Owner’s Manual
TA40999 LaserWriter IINT: -8132 Error Is Manual TimeOut Error
TA38932 LaserWriter Plus: Additional Error Codes
TA37722 LaserWriter Plus: ROM Error Gives Wrong Version Number
TA29370 LaserWriter Pro 600: PostScript Error Printing Legal Size
TA33334 LaserWriter Pro 630: Virtual Memory Error
TA35789 LaserWriter Pro 810: Common RCF Errors
TA34745 LaserWriter Pro 810: SCO UNIX 3.2 Error Code 2
TA31414 LaserWriter Pro 810: Time Out Error Using LocalTalk
TA35435 LaserWriter: Driver errors
TA39096 LaserWriter: How To Get Hardcopy Error Printouts
TA46374 LaserWriter: Timeout Error Messages Printing Long Documents
TA32940 LaserWriter: Windows PS Header Not Loaded” Error
TA36249 LaserWriters: Meaning of VMerror and Limitcheck Errors
TA48245 Lisa 1/2-MB System: Error 815/315 while installing OS 3.0
TA29726 Lisa Pascal 3.0: Can’t copy protected file; error 1130
TA34599 Lisa Peripheral Cards: Responding to error #1222
TA40189 Lisa: Daisy Wheel Printer Error Numbers
TA40203 Lisa: Dot Matrix Printer — Error Numbers
TA46646 Lisa: Error 38 is No Boot File on Disk”
TA40202 Lisa: Error Numbers
TA47440 Lisa: Error Tones
TA40226 Lisa: Memory Errors
TA35805 Lisa:10707 Error when Booting the Lisa Office Systems I Disk
TA39864 LisaCalc: Error Results
TA39968 LisaDraw: Error 3001 or 3007
TA28554 LisaList: Error Too Many Time Components
TA30087 LisaTest 2.2: Errors When Testing Macintosh Hard Disks
TA42318 Loading an Invalid Macro File Displays Incorrect Error Message
TS1147 Logic Express 8: Error messages when using Music For Picture template
TA23955 Logic Pro 7.2: Critical error occurred while registering with Stream Manager”
TA22599 Logic Pro 7: 48kHz で「Audio と MIDI を同期させようとした場合のエラー」
TA22640 Logic Pro 7: OMF ファイル読み込み時のエラー
TA22914 Logic Pro, Logic Express: セッションをバウンスするとき、またはトラックをフリーズするときにエラー -40 が発生する
TA23315 Logic Pro/Express 7: Emagic MIDI Driver error during launch
TS1094 Logic Pro/Express 8: Error when bouncing files
TA23099 Logic Pro: Unsupported File System” error in Project Manager
TS2111 Logic Pro/Logic Express:オーディオと MIDI の同期エラー
TA32833 MAE 1.0a Patch Error: Patch Cannot Be Applied (11/94)
TA35596 MAE 2.0 DEMO: Error fatal libX11.so.4: can’t open file” (6/96)
TA35593 MAE 2.0: AT_sigio select:bad file number” Shell Error (5/96)
TA35466 MAE 2.0: Failed to get ROM memory” Error on Solaris (5/96)
TA35481 MAE 2.0: Booting from boot2 resources fails! Fatal Error (5/96)
TA34351 MAE 2.0: Error Code 1 on HP Installing STREAMS (8/95)
TA32000 MAE Trial: Install Check Sum Error (6/94)
TA31849 MAE: Can’t Open Display Error Message (6/94)
TA36365 Mac OS 7.6: Extensions Manager Spelling Error
TA43878 Mac OS 8.5 : インターネットまたは File Exchange コントロールパネルを開くとエラーが表示される
TA37560 Mac OS 8.5.1 : PowerBook 1400 に CD からインストールするときに発生するエラー
TA37603 Mac OS 8.5.x: Error Printing LPR Job
TA25791 Mac OS 8.5: Sherlock Error Accessing Browser
TA37511 Mac OS 8.5: System Error Type 7
TA38760 Mac OS 8.5: Utilities Report Errors on Mac OS 8.5 CD
TA44303 Mac OS 8.6: Error Installing With Norton Crashguard Enabled
58766-ja Mac OS 9.1: CD-R/CD-RW 初期化時のエラーについて
TA26052 Mac OS 9.1: Error When Initializing CD-R/CD-RW Disc
TA20770 Mac OS 9.2, Mac OS X: Code Fragment could not be prepared. PrefRestoreInit’ error type 1010” During Computer or Classic Startup
TA20573 Mac OS 9.2.1:「ネットワークブラウザ」で接続したときのタイプ 12「エラー」
TA20755 Mac OS 9: A System error occurred while executing an Internet Scripting command” Alert Message
50565-ja Mac OS 9: Error Messages 1, 2, and 3
TA26324 Mac OS 9: Possible Port in use” Error With Palm Desktop 2.5 Installed
TA26420 Mac OS 9: Type 41 Error and VistaScan Software
TA38962 Mac OS 9: World Book No article updates are available” Error
TA44409 Mac OS 9: 「Mac OS 特別付録」にあるデスクトップパターンを開くとエラーが表示される
TA26273 Mac OS 9: アプリケーションが終了するエラーメッセージ
TS2205 Mac OS 9: インストール中の「Big System Morsels」エラー
60834-ja Mac OS 9: タイプ 41 エラーと VistaScan ソフトウェア
HT1618 Mac OS System Error Codes: 0 to -261
HT2088 Mac OS System Error Codes: 1 から 32767
TA48145 Mac OS System Error Codes: Uncommon Codes
HT2237 Mac OS System Error Codes: システムエラー -299 から -5553
9805-ja Mac OS System Error Codes: システムエラー 0 から -261
TA20514 Mac OS X 10.0, Sherlock:「予期せぬエラーが発生しました」メッセージ
HT2711 Mac OS X 10.0: Disk Utility が起動ボリュームのディスクエラーを誤って報告する
TA20386 Mac OS X 10.0: Epson SC 740 Printer Error -27 Message
106188-ja Mac OS X 10.0: Epson SC 740 プリンタエラー -27 メッセージ
TA20781 Mac OS X 10.1: An unexpected error has occurred. -108” Alert Appears
TA20831 Mac OS X 10.1: Error Code -50” Alert Appears When Copying Files From a Remote Disk
TA20793 Mac OS X 10.1: Error code -1000” When Burning a DVD-R Disc
TA26532 Mac OS X 10.1: DVD Player 3.1 Unexpectedly Quits With a System Error”
TA20946 Mac OS X 10.2: Classic の「インターネット設定機能拡張エラー -677」警告メッセージ
TA22328 Mac OS X 10.2: USB-Based PostScript Printer Does Not Print or Generate PostScript Error
TA20949 Mac OS X 10.2: Windows 対応コンピュータに接続するときの「SMB 接続エラー = -36」警告メッセージ
TA20948 Mac OS X 10.2: Windows 対応コンピュータに接続するときの「エラー = -50」
TA21195 Mac OS X 10.2:「エラー 1016」、アプリケーションを管理しているとき Classic がうまく起動しない
TA20890 Mac OS X 10.2:「エラーコード 1016」警告メッセージ
TA23348 Mac OS X 10.3 and later: AppleScript スクリプトで Keychain Scripting が「動作しない」エラー
TA22455 Mac OS X 10.3:「計算記録」の「丸めエラー」
TA23008 Mac OS X 10.4 Tiger: AFP サーバに接続しようとすると“接続に失敗しました”というエラーが発生する
TA23763 Mac OS X 10.4.3: 古い DVD からソフトウェアをインストールする場合に表示される“パッケージの読み込み中にエラーが起きました”という警告メッセージ
TA24097 Mac OS X 10.4.6: 警告メッセージが表示されず、または“error: can’t fragload”というメッセージが表示され、アプリケーションを起動できない
TA23563 Mac OS X 10.4: AFP ホームディレクトリからディスク作成フォルダを削除しようとすると、エラー -61 が発生する
TA23139 Mac OS X 10.4: Emagic A26 および A62m ドライバのインストール後のエラー
TS1743 Mac OS X 10.4: MobileMe 同期実行中のエラーコード 5006 を解決する
TS1564 Mac OS X 10.4: Windows サーバに接続するとエラー -36 警告メッセージが表示される
TA23761 Mac OS X 10.4: エラー -8058、Finder でディスクをコピーしようすると、ディスクを取り出せない
TA23407 Mac OS X 10.4: ソフトウェアアップデート使用中にネットワークエラー“無効なサーバ応答 -1011”が発生する
TS1642 Mac OS X 10.5 (Japanese): 7 回消去または 35 回消去を行った場合の、ディスクユーティリティの“内部エラー
TS1722 Mac OS X 10.5, Boot Camp:Windows XP の初期設定中に「ディスクエラー」と表示される
TA25081 Mac OS X 10.5: HP LaserJet 1200 prints error” message at end of each print job
TS1643 Mac OS X 10.5: iChat AIM アカウントのメンバーリストが繰り返し展開したり折りたたまれたり、ログインエラーが発生したりする
TS1198 Mac OS X 10.5:iDisk にアクセスする際に、“エラーコード -35”が表示される
31247-ja Mac OS X Public Beta: AFP サーバで「ドロップボックス」エラー
106034-ja Mac OS X Public Beta: Disk First Aid が MountCheck エラーを表示する
60742-ja Mac OS X Public Beta: PostScript エラーを管理できない
TA38714 Mac OS X Server 1.x:“ネットワークへ接続できない”というエラー
TA38957 Mac OS X Server 1.x:「reserveDebuggerLock: already locked(ロックされています)」エラー
TA28337 Mac OS X Server 10.0, 10.1: 5015 error” Alert Message When Saving Newly Created Users
TA28254 Mac OS X Server 10.0:「プログラムエラーが発生しました」メッセージ
TA28261 Mac OS X Server 10.1: ユーザのインポート中に“Error 5004”が表示される
TA20966 Mac OS X Server 10.2: Mac OS X 10.2.1 (クライアント) 上にインストールする際のエラーメッセージ“Cannot install due to Errors(エラーのためインストールできません)”
TA21244 Mac OS X Server 10.2: NetBoot クライアントをサーバに接続するときに「Error -36」が発生する
TA23183 Mac OS X Server 10.3: Batch-promoted admin can’t change user password (-14090 error)
TA23072 Mac OS X Server 10.3: Error -43 when renaming files or folders using WebDAV
TA24139 Mac OS X Server 10.4.2: Mac OS X Server のウェブログに接続すると、Internal Server Error が表示される
TA24134 Mac OS X Server 10.4: Bad address syntax error” message when sending e-mail using WebMail
TA24162 Mac OS X Server NetInstall: There were errors installing. Please try again.”
TA24996 Mac OS X Server version 10.5: CoreFoundation Messages in Apache error log when performing Spotlight website search
TA20911 Mac OS X Server: Error -35” in Server Admin When Changing Sharing Attributes
TA23783 Mac OS X Server: DIGEST-MD5 での認証問題、SASL エラー -13
TA44253 Mac OS X Server: Disk Copy Reports Error -8812
TA39073 Mac OS X Server: NetBoot Desktop Admin Error Message -43
TS2269 Mac OS X Server: 管理者ユーザが「パスワードサーバ」に戻ったときの「エラー -14090」
TS1701 Mac OS X v10.5 Leopard: Error code -5016” when accessing your iDisk
TS1602 Mac OS X 共有ポイントから特定のファイルを転送中に Microsoft Windows でエラーが表示される
TS2039 Mac OS X, Mac OS X Server: ファイルを Windows 共有ボリュームにコピーするときの「エラー -43」
TA21156 Mac OS X: Error Creating Folder… Access Denied” When Installing Photoshop Elements 2.0 From CD
TA20661 Mac OS X: Error code -37” When Copying Files to Earlier AppleShare Servers
TA22339 Mac OS X: Error in user parameter list (-50)” With MS DOS-Formatted Volume
TA20913 Mac OS X: File Create Error” With HP ScanJet USB Scanner
TA24071 Mac OS X: Network error -1011” when trying to use Software Update with Direcway Mac ISP
TS2040 Mac OS X: Print failed due to program error” when printing a 2 GB or larger graphic
TA20585 Mac OS X: CGI を動作させているときのエラーに対するトラブルシューティング方法
TA20680 Mac OS X: Classic 環境が起動完了しない - 機能拡張のコンフリクトまたは“バスエラー
TS1429 Mac OS X: iDisk に接続できない、「エラーコード -50」が表示される
TS2028 Mac OS X: ジャーナリング機能がオンになっていると fsck が問題のないエラーを報告する
HT2718 Mac OS X:CD-R、CD-RW、または DVD-R メディアの作成時に「不明なエラー - 2147352480」というメッセージが表示される
TA25025 Mac OS: AppleTalk Network Has Been Interrupted” Error
TA21805 Mac OS: There Is A Problem With The Disk…” Error Message
TA21832 Mac OS: AppleTalk の「使用中のポート」エラー
TA37510 Mac OS: Applications Give Disk Is Full” Error Message
TA21578 Mac OS: Troubleshooting Type 1, Type 2, and Type 3 System Errors
TS2207 Mac OS: エラータイプ 41
TA36289 Mac OS: ソフトウェアインストール時に -44 エラー
TA21949 Mac OS: ヘルプビューアがタイプ 3 のエラーで終了する
TA25701 Mac OS: メモリ不足エラーのトラブルシューティング
TA21669 Mac OS: ランチャーを起動する際の“-39”または“-192”エラー
TA22071 Mac OS: 起動中の「International Utilities が存在していません」エラー
TA25412 Mac OS:「Finder が起動できませんでした」エラーメッセージ
TA22051 Mac OS:「Lib ファイルが見つからない」エラーのためアプリケーションが開かない
TA26394 Mac OS:「インターネット設定機能拡張」がないとタイプ 3 またはタイプ 10 エラーが起こる
TA21958 Mac OS:「ファイル・シンクロナイズ」で“メモリ不足”エラーが発生する
TA25141 Mac Pro (Early 2008): Error message when using Send Registration Assistant
HT3193 Mac Pro (Early 2008): IRQARB Error reported in 64-bit Microsoft Vista
TS2081 Mac Pro: Apple Hardware Test のエラーメッセージ
TA36751 Mac3D 2.0: System Errors
HT3259 MacBook Air (Late 2008) with Solid State Drive:Microsoft Windows XP のインストール時に、ファイルが見つからないという旨のエラーメッセージが表示される
HT3271 MacBook Air (original): MSI package” error message when installing DVD or CD Sharing on Microsoft Vista 64
TS1576 MacBook Air:リモートディスクで DVD ムービーやオーディオ CD にアクセスしようとすると、「オリジナルの項目が見つかりません」というエラーメッセージが表示される
TA32982 MacCheck 1.0.3: Missing a file record…” Error (12/94)
TA46178 MacDFT, PF10 Function, and 32798 Error
TA44534 MacDFT, TokenTalk, and Error 32804
TA41905 MacDraw II or MacDraw Pro: Translated DXF File Error Message
TA41477 MacDraw II, Claris CAD: Closepath Error Using LaserWriter Driver 6.0x
TA41437 MacDraw II: Limitcheck Error When Printing
TA41741 MacDraw II: System Error when Saving on Quadra
TA43131 MacDraw Pro 1.5v2: EvenBetterBusError
TA41652 MacDraw Pro: AppleShare Print Server Error Message
TA41936 MacDraw Pro: Changing Text Color Documentation Error
TA41640 MacDraw Pro: Crashing/System Error Launching
TA41705 MacDraw Pro: Installation Error Message
TA42843 MacDraw Pro: Manual Feed Printing Results in Type 1 Error
TA43082 MacDraw Pro: PostScript Error with A la Carte EPSF Clip Art
TA41826 MacDraw Pro: Toggling Fast Gradients System Error
TA35801 MacIPX and Comm Slot II: Ethernet Errors
TA40341 MacLink Plus: Explanation of Errors 106 and 124
TA41217 MacPlot: Not enough memory to plot this document” Error
TA41382 MacPlot: Corrupted Driver Error Messages
TA30188 MacSNMP: Mac System MIB Compile Error (4/96)
TA31696 MacTCP 2.0.6: Error While Installing Update Patch (12/94)
TA33071 MacTCP 2.0.6: Invalid Domain Name, Syntax Error (12/94)
TA34071 MacTCP: Error Codes Defined
TA33881 MacTCP: Not Installed or Disabled Error (6/95)
TA27831 MacTerminal 2.2: Launching Error May Be Caused By CNFG (10/94)
TA29809 MacTest 6.0: Wrong Error Number During Test Of External Drive
TA33015 MacTest 7.0: 500XX and 400XX Errors
TA32108 MacTest Pro: False SCC Loopback Error On Power Macintosh (7/94)
TA31425 MacWorks XL: Encountering Error -96 During Hard Disk Install
TA48118 MacWorks XL: Error on Hard Disk Startup
TA28998 MacWrite II 1.1v3 and Earlier: Font Error Messages
TA44917 MacX & MacTCP: unimplemented co-routine error 12” (11/94)
TA48036 MacX 1.1.7 Font Error
TA47544 MacX: Another Window Manager Already Running” Error
TA45986 MacX: Bad STARTFONT Statement Error Caused by Lower Case Type
TA38927 MacX: Crash Type Error 2
31143-ja MacX: タイプエラー 2 でクラッシュする
TA30722 Macintosh 128K, 512K, Plus: ID = 02 Errors From External Drive
TA30740 Macintosh : Bomb and ID=02 Errors On Older Macintosh
TA45089 Macintosh Classic: Disk Errors May Be WDEF Virus
TA37971 Macintosh II: MacFortran Error When Making New Palette” Calls
TA39125 Macintosh II: System Error 25 When Using Three Or More Monitors
TA22107 Macintosh Management Server: エラー“-5047”について
TA26435 Macintosh Manager 2:「AFP ユーザログイン」エラー
TA20893 Macintosh Manager 2:「Error -23045」 警告メッセージ
TA46347 Macintosh Manager: Access to Hybrid CD Error
TA27376 Macintosh Manager: DNS Errors in TCP/IP Applications
TA38872 Macintosh Manager: Error Macintosh Manager works best in thousands of colors”
TA22147 Macintosh Manager: エラー“-5019”
TA33481 Macintosh Pascal 1.0: Error ID=02 on 512K with no external drive
TA34786 Macintosh Performa: Error Type 2012 (12/95)
TA46039 Macintosh Portable: External Hard Drives and Sad Mac” Errors
TA39227 Macintosh PrintMonitor: Error -1096
TA25954 Macintosh Server G4: チェックサムエラーのメッセージへの対処方法
TA25994 Macintosh Server G4: 電源の交換を要求するエラーメッセージについて
TA46176 Macintosh System Errors: Possible Sources
TA32757 Macintosh Tutorial: Not Enough Memory Error Resolution (5/95)
TA46207 Macintosh to VAX Connectivity and Fatal Error 1020
TA47101 Macintosh: Bad F-line Instruction” Error
TA27875 Macintosh: Not Enough Room to Duplicate” error
TA38369 Macintosh: Out of Memory” Error When Connecting a QuickTake Camera
TA36655 Macintosh: Port in Use” Error Message
TA44003 Macintosh: Rounding Errors”
TA28140 Macintosh: Unexpectedly Quit” Error Codes
TA29227 Macintosh: Compressed Archives and Error -39 (4/93)
TA48107 Macintosh: Correcting ID -127 Internal File System Error
TA46725 Macintosh: Error -61 Write Permissions Error”
TA46610 Macintosh: Error 51 Unserviceable Slot Interrupt”
TA25529 Macintosh: Foreign File Access エラーメッセージ
TA28899 Macintosh: Installer Error Codes 2231 and 2232 (2/93)
TA28173 Macintosh: Moving Fonts and Error -192
TA32554 Macintosh: Please Insert the Disk:… Error
TA44464 Macintosh: System Error Codes Explained
TA29885 Macintosh: System Error Type 15 (8/93)
TA46875 Macintosh: Troubleshooting Non-Apple Disk Error”
TA48160 Macintosh: Troubleshooting Bus Error Messages
TA46668 Macintosh: Troubleshooting Error -42 tmfoErr”
TA47103 Macintosh: Troubleshooting ID=01 Bus Error”
TA46654 Macintosh: Troubleshooting ID=10 Trap Error Bombs
TA46321 Macintosh: Troubleshooting ID=15 Segment Loader Error
TA46399 Macintosh: Troubleshooting a System Error ID=01” Message
25082-ja Macintosh: USB CD-R 装置に書き出すときのエラー
TA34780 Macintosh: Unimplemented Trap Error Message Explained (11/95)
1749-ja Macintosh: システムエラーコードの説明
TA46376 Macintosh:“Sad Macintosh”エラーコードの意味
TA44030 Macintosh:“目的のデバイスに問題が生じました。エラーコード -7932”警告ダイアログ
TA32045 Mario Teaches Typing: Type 1 Errors Caused by Preferences (7/94)
TA33769 MegaPhone: -93 Error Bomb (5/95)
TA36450 MegaPhone: Type 11 Error With GeoPort Software
TA34345 Megaphone: -17 Error Message (9/96)
TA38302 Message Pad 2000: Newton Works Error When Ejecting a Flash Card
TA21955 Microsoft Internet Explorer:「Java VM を読み込むことができません」のエラーメッセージについて
TA20830 Microsoft Internet: Error of Type -2” When Opening Explorer, Outlook Express, or Entourage
TS1748 MobileMe, Mac OS X 10.5: MobileMe のパスワードを変更した後、「サーバからエラーが返されました」という警告が表示される
TS1764 MobileMe: iDisk full” error
TS1180 MobileMe:2 GB を超えるファイルを iDisk にコピーすると、Finder がフリーズする、または「error -36」警告が表示される
TS1706 MobileMe:メールの配信が遅れたり、「452」エラーメッセージと共にメールが差出人に戻される
TA37389 Modem: No Dial Tone” Error But I Can Hear One
TA23224 Motion 2: Error when exporting tutorial project to Compressor
TA44932 MultiFinder: Background Print Monitor Errors
TA31223 NCK for Macintosh: Resources Not Found Error
TA42262 NPER (Number of Periods) Documentation Error (SS)
TA45556 NeXTSTEP 3.0: Fatal Signal 11 Error
TA36329 Network Administrator Toolkit: Three Error Messages
TA47185 Network Assistant 4.0.x: Errors When Remotely Shutting Down or Restarting
TA25400 Network Assistant 4: システム起動時のバスエラー
TA34990 Newton 2.0 OS: Error -48200 Trying to Print
TA34895 Newton 2.0 OS: Error -48402 in Calls Application
TA37365 Newton Connection Applications: Communication Tool Error
TA31026 Newton Connection Kit for Windows: -10066 Error
TA31222 Newton Connection Kit for Windows: Truncated Line Error
TA31083 Newton Connection Kit for Windows: VCD.386 Error
TA32227 Newton Connection Kit: Disk Errors Occur When Exporting
TA31517 Newton Connection Kit: Import & Export Translation Errors
TA37277 Newton Internet Enabler 2.0: -60508 Error When Connecting Via LocalTalk
TA31772 Newton MessagePad: Correcting Error -48205
TA30488 Newton MessagePad: Date Book Error -48009
TA31741 Newton MessagePad: Error -48204, -48205 on Mystery Capers
TA31747 Newton MessagePad: Missing document creates Error -48807
TA32823 Newton MessagePad: Types of Memory & Memory Errors
TA30977 Newton MessagePan: -20006 Error During System Update
TA36415 Newton OS 2.0: CSTW 2200 Printing Errors with Some Apps
TA40444 Newton OS 2.x: Solution for NewtWorks (-48204) Error
TA43948 Novell Netware: AARP Packet Size Error Fix Available
TA24890 Office 2004 for Mac Test Drive in French and Dutch displays an expired” error message when opened
TA28739 Ofoto for Windows: Out of Memory Error in 16-bit Video
TA36199 Open Transport & Microsoft Exchange: Network Error (11/96)
TA36507 Open Transport/PPP: Error Codes
TA35484 Open Transport: Error Codes
TA37138 PC Compatibility Card: ATI MPEG Player Hardware Error Message
TA36652 PC Compatibility Card: At Ease 3.x Errors (4/97)
TA36076 PC Compatibility Card: CDR101 error reading CD-ROM Discs (10/96)
TA35516 PC Compatibility Card: PostScript Errors From Windows 95 (5/96)
TA36706 PC Compatibility Card: Video Adapter Error in Win95
TA35883 PC Compatibility Cards: Errors Installing Video Software (8/96)
TA31914 PC Exchange: Error Opening Control Panel (6/94)
TA38372 PC Setup 1.6.4: PC Compatible Error
TA36592 PC Setup Unimplemented Trap, Error Message (3/97)
TA35022 PCI-Based Power Macintosh: -50 Error When Ejecting CD (5/96)
TS1266 PIN ロックされている SIM カードを使った iPhone の iTunes 7.5 におけるアクティベーションエラー (エラー番号:0xE8000013)
TA42264 PMT (Payment) Function Documentation Error (SS)
TA23027 Pages 1.0: Template Could Not be Found” error on French systems
TS2130 Pages: テンプレートを同じ名称で再保存するとエラーの原因となる
TA44885 Pascal III: Error code summary
TA33583 Pascal III: Mapping of SOS error codes
TA36986 Pascal III: SOS Error Codes
TA45532 Pascal: Error Messages
TA45347 Pascal: Error Numbers–Runtime Pascal
TA45307 Pascal: Run-time errors
TA36678 Performa 6360 & 6400: Performa Demo and -108 Error (4/97)
TA36607 Performa 6360/6400: PhotoDeluxe User Guide Error (3/97)
TA34999 Performa 640, LC 630 DOS Compatible: Error 003 and 005
TA29722 Performa: AtEase System Error Type 41
TA29981 Performa: Type 1 Error in Apple Backup (8/93)
TA33976 Personal LaserWriter LS: Time Out Error
TA34373 PhotoFlash 2.0: Type 11 Errors on PCI-based Power Macs (9/96)
TA36325 Photoflash Script Errors With Some Computers
TA35878 Physical Layer Ethernet Errors (8/96)
TA34470 Plaintalk 1.4.1: PostScript Error When Printing Read Me (10/95)
TA35704 Portable StyleWriter: Out of Paper Error
TA46309 PostScript: Common Causes of Errors
TA33981 Postscript Errors Printing From MAE to Sparc Printer (6/95)
TA26056 Power Mac G4 (Digital Audio) ― Apple Hardwareのエラーコード
TA22226 Power Mac G4 (Digital Audio): Apple Hardware Test 1.1 Reports False Error
TA26035 Power Mac G4 (Gigabit Ethernet): Apple Hardware Test 1.0 Error ata4/1/2
TS2241 Power Mac G4 and Power Macintosh G3: メモリエラーダイアログボックスが画面に表示される
95048-ja Power Mac G4: 起動ディスクエラーのメッセージ
TA27119 Power Mac G5, Apple Hardware Test 2.1: 一部のエラーメッセージについて
TA25846 Power Macintosh G3 (Blue and White) : Imation Superdisk 1.2 ドライバをインストールするときのエラー
75016-ja Power Macintosh G3 (Blue and White), G4: メモリエラーと USB 装置について
TA43916 Power Macintosh G3 (Blue and White): Bus Error After Installing Displays Software 1.7
TA25828 Power Macintosh G3 (Blue and White): Error When Opening AOL Without Modem Installed
TA21978 Power Macintosh G3: Error -2004 When Playing System Sounds
TA21766 Power Macintosh G3: Error in Apple Video Player on Second Monitor
TA25087 Power Macintosh G3: PATHWORKS error on startup
TA31777 Power Macintosh: PowerPC Finder Update” Error Message
TA33295 Power Macintosh: DART 1.5.3, -64 Error (2/95)
TA31909 Power Macintosh: Error Tones With Upgrade Card (6/94)
TA32088 Power Macintosh: GeoPort and Jabra Earphone ARTA Error (7/94)
TA38178 Power Macintosh: Mac OS 7.6 Installer Error Message
TA21770 Power Macintosh: MacIPX Errors
TA21619 Power Macintosh: Meaning of Error Type 11
TA35467 Power Macintosh: Memory Test Error Message At Startup (6/97)
TA31825 Power Macintosh: Network Extension Error (6/94)
TA34714 Power Macintosh: No FPU Installed Error
TA34138 Power Macintosh: Norton’s Reports Directory Errors
TA21678 Power Macintosh: Type 11 & No FPU Errors Technote
TA25993 PowerBook (FireWire): システム起動中の断続的なエラー
TA36343 PowerBook 1400, 200, 2300: Disk Copy Needs Floppy Drive Error
TA37305 PowerBook 1400: Mac OS Info Center Installer Error
TA36337 PowerBook 1400: Not An HFS Disk & Installation Errors
TA37231 PowerBook 2400, 3400, G3 PC Cards:「カードおよびソケットサービスが存在しません」エラー
51128-ja PowerBook 2400C: Freezes or Displays an Error Message During Startup
TA32932 PowerBook 280 and 500: RAM Disk Shutdown Error
51583-ja PowerBook 3400: Freezes or Displays an Error Message During Startup
51588-ja PowerBook 3400: The Computer Freezes or Displays a System Error Message
TA32798 PowerBook 500 Series: PowerPort 500 Error on Startup (5/95)
51251-ja PowerBook 5300: Freezes or Displays a System Error Message
TA35439 PowerBook 5300: GlobalFax Error Message (5/96)
51260-ja PowerBook 5300: If I Open or Move a Font File, I See an Error Message
51285-ja PowerBook 5300: Nothing Happens, or an Error Message Appears, When I Try to Print
51214-ja PowerBook G3 Getting Started: Freezes or Displays a System Error Message
51208-ja PowerBook G3 Getting Started: Freezes or Displays an Error Message During Startup
51239-ja PowerBook G3 Getting Started: Nothing Happens, or Error Message When You Print
51223-ja PowerBook G3 Getting Started: When Opening or Moving a Font File, You See an Error Message
TA44431 PowerBook G3 Series (Bronze keyboard): スリープからの復帰後にプリンタのエラーが生じる
51145-ja PowerBook G3 Series: Freezes or Displays a System Error Message
51139-ja PowerBook G3 Series: Freezes or Displays an Error Message During Startup
51175-ja PowerBook G3 Series: Nothing Happens, or an Error Message Appears, When you Try to Print
51154-ja PowerBook G3 Series: When Opening or Moving a Font File, You See an Error Message
TA22011 PowerBook G3 Series:「必要なハードウェアが見つからないため、Apple DVD Player が開けません」エラー
TA28091 PowerBook: Error -39 May Be Corrupted Fax Monitor Pref File 6/92
TA35206 PowerBook: Error Waking From Sleep w/ System 7.5 Updt 2.0 (1/97)
TA34427 PowerShare SMTP Gateway: Launch With -1625 Error (9/95)
TA33666 PowerShare: Error Code -1660, and Troubleshooting
TA34978 PowerShare: Error Code 83 Meaning (1/96)
TA34416 PowerTalk and PowerShare: Error Code Listing
TA33271 PowerTalk and System 7.5: -15064 Error (2/95)
TA41059 PrintMonitor Error -36: Corrupted Volume or WDEF Virus (11/94)
TA46299 PrintMonitor: found an internal problem” Error
TA28732 PrintMonitor: Where=80 and Why=-50 Error Messages
TA46047 PrintMonitor: Why=6 and Why=-120 Error Messages
TA33346 PrinterShare: Not Enough Memory Error (International)
TA34028 ProDOS Access Unit: Volume not found error
TA47356 ProDOS: Error 900 When Using Apple IIc Sys Utilities Disk
TA33462 ProDOS: Error Codes
TA36292 ProFile Formatting Error #21
TA35910 Protect Applications Folder Error Messages
TA32992 Quadra 630: Internal HD Formatter Error Message (12/94)
TA43353 Quick Help Error in HLOOKUP (Horizontal Look Up) ClarisWorks 4.0 Macintosh
TA34831 QuickDraw 3D: Out of Memory Errors
TA33558 QuickDraw GX: Corrupt Fonts and Error -27,949 (4/95)
TA32937 QuickDraw GX: Non-Native Error on Reformatted Drive (2/95)
TA32433 QuickDraw GX: Repair Utils Show Resource Fork Error (2/95)
TA44395 QuickFile III: String overflow error
TA37175 QuickTake 200: Low Battery and Card Error
TA38544 QuickTime 3: Windows 95/NT Rundll Installation Error
TA25396 QuickTime 5 Public Preview: Error Message on Restart After Installation
TS2535 QuickTime MPEG-2 Playback Component:MPEG-2 ビデオを含むファイルを開くときにエラー -2048 が発生する
TA26754 QuickTime Streaming Server 2.0: アクセスログとエラーログを調べる
HT2673 QuickTime Streaming Server : エラーコード
TA36348 QuickTime for Windows 2.1.x: Error Updating INI Files
TA38915 QuickTime for Windows: Error -2093
TA21836 QuickTime: Windows へのインストール時にエラーメッセージが表示される
TA22050 QuickTime: 起動時のエラーメッセージ
HT3392 RAID Admin: イベントログの Logical Block Address (LBA) エラーについて
TA43597 Reducing the Probability of Illegal Operation Errors in Windows 95
TA24198 Remote Desktop 3.0: Some reports appear blank or respond with an error message
TA35589 Retrospect 3.0: Virtual Memory and dev.c-1027” error
TA34683 Retrospect: -50, feature not supported” Error
TA31890 Retrospect: Internal Consistency Check Failed” Error
TA29341 Retrospect: Error 206 (media failure)
TA29985 Retrospect: Error Messages (1 of 2)
TA29986 Retrospect: Error Messages (2 of 2)
TA29984 Retrospect: Execution Errors Browser
TA29995 Retrospect: Internal Consistency Check Error
TA31378 SAM 3.5.x & Apple File Exchange: Error Type 33 (3/94)
TA36686 SCSI Disk Mode: Start Up Error Message (4/97)
TA46981 SNAps: 510 Error on SDLC Connection
TA46737 SOS: Error messages
TA23785 Safari: POSIX error when attempting to upload
TA35026 Scholastic SuperPrint: Clip Art Files Manual Error (1/96)
TA43417 Scientific Notation Calculation Errors in ClarisWorks for Windows
TA42974 Segment Load Failure Errors in Windows
TA45969 Sherlock: Error When All Search Sites” Selected
TA22005 Sherlock: エラーメッセージ「ネットワークエラーが起きました」
TA44443 Silentype: Spacing errors
TA33767 Slow Start Up: LocalTalk with Printing Errors (7/95)
TA32126 SoftWindows, ImageWriter II, Type 1 Errors When Printing (7/94)
TA46660 Softcard III: BDOS Errors
75098-ja Software Downloads: フォーマットと一般的なエラーメッセージ
TA38101 Sony CD-RW/DVD CRX830E モデルのドライブを使って iTunes for Windows でディスクを作成しようとすると「4280 エラー」が表示される
TA23382 Soundtrack Pro: 書類を保存できないエラー
TA23439 Soundtrack Pro:“一部のレンダリングファイルがみつかりません”エラー
TS2158 Soundtrack Pro:.SATP プロジェクトを開くと「ファイルが見つかりません」エラーが起こる
TS1107 Soundtrack Pro:Logic 7 への送信時「モノ ステレオ 障害!」エラー
TS2204 Soundtrack: Error when multiple Soundtrack client nodes simultaneously record to a folder on an Xsan
TA37614 Speech Recognition 1.5.4: Error with Power Macintosh/Performa 5xxx/6xxx
51492-ja StyleWriter 1200: The Printer Detects an End of Paper Error
51491-ja StyleWriter 1200: There is an Error in the Printer
51451-ja StyleWriter 1500: The Printer Detects an End-of-Paper Error
51450-ja StyleWriter 1500: There is An Error in the Printer
TA29506 StyleWriter II: Spacing and Margin Errors With ATM
TA48203 System 6: Memory Errors Under MultiFinder 2/93
TA32797 System 7.5 & QuickDraw GX: Finder:error type 11” (2/95)
TA35377 System 7.5 Update 2.0: Global Village Startup Error (4/96)
TA35937 System 7.5.3, Telecom 2.3.2, Quadra 840AV & Type 1 Error
TA35881 System 7.5.3: Out of Memory Error After Fax (8/96)
TA36107 System 7.5.5: Needs System 7.5.3 Error Message (10/96)
TA34838 System 7.5: AppleScript Automated Tasks Time Out Error
TA31457 System 7.5: Error Installing Printer Software
TA33196 System 7.5: The Print Shop ATM Errors and ATM GX (1/95)
TA46588 System 7.x: Compatibility Checker Error Messages
TA47860 System 7: Application Cannot be Found Error/Fix
TA28563 System 7: Bus Error Message After Installing
TA28626 System 7: Bus and Address Errors After Clean Install
TA48220 System 7: Error -199 Is Map Inconsistent with Operation”
TA46592 System 7: Error Type -192 Appears when Removing Fonts
TA28832 System 7: Error When Copying Disk Image to RAM Disk
TA46501 System 7: Memory Errors in PrintMonitor
TA28801 System 7: Old Adobe Fonts and Type 1 Errors
TA46452 System 7: TypeAlign Font Not Available” Error
TA34592 Telecom 2.3: Fax for PC Card Modems Read Me Error & Info (2/97)
TA42037 Think C: Troubleshooting Bus Errors
TA34211 Third-Party Extensions Managers & Possible Bus Errors (8/95)
TA32465 Too Many Nested Folders Error (9/94)
TA42376 Trading SYLK files with Excel Causes an Out of Memory Error in Excel (SS)
TA43498 Troubleshooting Win32s Errors in Windows 3.x
TA43727 Troubleshooting Windows Printing Issues (Errors Or WYSIWYG)
TA43546 Troubleshooting the Unhandled Exception Error in Module WIN32SCOMB.DLL or APPSETUP.EXE in Claris Impact 1.0 for Windows
TA32116 TrueType: TrueType Already Installed Error (7/94)
TA43387 Type 11 Errors in ClarisWorks
TA25789 USB プリンタ: シリアルポートが“使用中”または“-192 エラー”表示
TA25618 USB: エラーメッセージが表示されたときの対処方法
TA45889 Unix Deployment Time Zone Error
TA43725 Updated Windows 95 Driver For The HP LaserJet 5 Family Seems to Reduce Printing Errors
TA42501 Updater Generates an Error
TA43203 Using Express Modem Tool with ClarisWorks 3.0, System 7.5, and Power Macintosh Gives Error -11
TA38247 WGS 9650/350: Set Up Addendum Errors
TA43179 WIN32s Error 193 When Installing ClarisWorks 3.0
TS2136 WaveBurner:ディスク作成中に ISRC コードエラーが表示される
TA45392 WebObjects 4.0.1: DirectToWeb Assistant のエラーを回避するための方法
TA45439 WebObjects 4.5: Solaris の「Can’t find Xa.o」エラーメッセージについて
TA25398 WebObjects 4.x: _BridgeClassgenInitialization エラー
TA45394 WebObjects 4: Solaris Can’t find Xa.o” error message
TA26701 WebObjects 4: Troubleshooting Error Messages and the WebObjects URL
TA45445 WebObjects 4: WebObjects.conf ファイル作成に関するエラー
TA26719 WebObjects 4:「fatal error LNK1106」
TA46138 WebObjects 5 Deployment: Apple Netname Server Startup Error on Windows 2000
75137-ja WebObjects 5 Deployment: Windows 2000 での Apple Netname Server 起動エラー
TA47211 WebObjects 5.0: WORedirect attempt to load the application failed” Errors
51041-ja WebObjects 5.1: Solaris/Mac OS X に移動すると、パーミッション拒否エラーになる
TA21418 WebObjects 5.2: Mac OS X 10.3 へのアップグレード後の、java.lang.NoClassDefFoundError 例外の修正
TA47208 WebObjects: DirectAction メソッドで“EOEditingContext: Access With No Lock(ロックしないでアクセスしています)”エラーについて
TA37757 WebObjects: Solaris でリンクをクリックすると、UnsatisfiedLinkError の例外が発生する
TA45404 WebObjects: エラーを引き起こす可能性のある HP-UX の問題について
TA33535 What is a System Error 25? (4/95)
TS1942 What to do when Windows XP or Vista computer displays a blue screen error message when syncing the iPhone or iPod touch
TA33260 Who Built America CD and Type 15 Error (2/97)
TA33834 WiggleWorks: Reading Style and Documentation Error (6/95)
TA37448 Williams-Sonoma Guide to Good Cooking CD: Freeze/Type 10 Errors
TS1539 Windows XP で iPod を同期すると iTunes に「-50」エラーが表示される
TS1502 Windows XP/Vista コンピュータと iPhone/iPod touch の同期中、ブルー画面にエラーメッセージが表示された場合の対処法
302334-ja Windows で iTunes を開いたときの MAPI32.dll エラー
TA21296 Workgroup Manager: Error -14487”
TA21310 Workgroup Manager: error -14130” or error -14136” Message When Using LDAP
TA33724 Workgroup Server 8150: Getting Started” Manual Error
TA27790 Xserve G5: CPU CPU Slewing Verification Test” error appears in Xserve Remote Diagnostics 1.0
TA27803 Xserve G5: Xserve Remote Diagnostics 1.0 で「Storage.Fixed.SMART Test Result Status」エラーが表示される
TA27179 Xserve G5: Xserve Remote Diagnostics 1.0 の「CPU.G5.CPU Slot Number Verify」エラー
TA27177 Xserve G5: Xserve Remote Diagnostics 1.0 の「Display_ProbeForDevices」エラー
TA27178 Xserve G5: Xserve Remote Diagnostics 1.0 の「Probing Network」エラー
TA25094 Xserve RAID: パリティを再構築時のエラー
TA27570 iDVD 4:「Multiplexer Preparation Error(マルチプレクサー準備のエラー)」
TA23355 iDVD 5: DVD の作成中に、オーディオのエンコーディングエラー
TS2180 iDVD 6: ディスク作成中にエラー番号 34502 が表示される
TS2303 iDVD: レンダリングまたはエンコード時のスライドショーのエラー
TS1789 iDisk の認証エラー/ログインエラーのトラブルシューティング
TS1699 iDisk エラー -36 のトラブルシューティング
TA22155 iMac (Summer 2000) : Error 301 When Opening Apple DVD Player
25177-ja iMac (Summer 2000): Apple DVD Player を起動すると「エラー 301」が発生する
TA23583 iMac G5 (iSight) and Front Row: 曲を再生しようとするとエラーメッセージが表示される
TA21998 iMac: 起動時のアドレスと,不正なインストラクションエラーについてのトラブルシューティング
TS1037 iMovie 08: アップロード中にウェブギャラリーのエラーが表示される
TA22156 iMovie 2.0.1 Update File not found” Error Message
25180-ja iMovie 2.0.1 Update:「ファイルが見つかりません」エラーメッセージ
TA38141 iMovie HD プロジェクトをインポートすると Final Cut Express でエラーが表示される
TA22866 iMovie がファイルの書き出し/読み込み時に -43 エラーを表示する
TA25344 iMovie & Final Cut Pro: テープエラーのため書き出しができない
TA37699 iMovie: Quits With a Type 12 Error
TS2422 iPhone 2.x software: Error message when trying to use a custom Access Point Name (APN)
TS2380 iPhone and iPod touch:iTunes 8.0.1 またはそれ以降へアップデート後、不明なエラー (13014)、(13136)、または (13213) が起こることがある
TS2800 iPhone and iPod touch:バックアップから復元後に同期できないというエラーメッセージが表示される
TS2818 iPhone or iPod touch: Error message when connecting device to iTunes on Windows computer
TS1275 iPhone および iPod touch でのアップデートおよび復元時のエラーメッセージ
TA38600 iPhone: Error 0xE8000025” when syncing in iTunes for Windows
TA38601 iPhone: Exception error when syncing with Yahoo! Address Book
TS1683 iPhone:「修理が必要です」というエラーメッセージ
TS1076 iPhoto 08: Empty frames error message due to incorrect use of background selection
61601-ja iPhoto 1.1:「ホームページ」フォトアルバムの作成時に予期せぬエラーが起こる
TA22946 iPhoto 5 or later: Error occurred while exporting the slideshow” message
TS1054 iPhoto 7.1: ブックの注文時にエラーメッセージが表示される
TA38262 iPod Updater for Windows:「iPod」の復元またはアップデート時に「iPod 内部マネージャエラー」が発生する
TA24946 iPod game error message when launching different game types
300969-ja iPod shuffle:「アップデートまたは復元できませんでした」もしくは「ファームウェアのアップデートに失敗しました」エラーメッセージ
TA38648 iPod touch または iPhone でカレンダーイベントの同期中に「データ混合」エラーメッセージが表示される
HT1207 iPod を同期すると「ディスクから読み込んだり、ディスクに書き込むことができません」というエラーが表示される。または iPod をリストアすると「Firmware update failure」というエラーが表示される
TA23402 iPod ソフトウェアのインストール中に起こる「Mac OS X Networking Update」エラー
TA23381 iSync 2: Motorola の携帯電話と同期すると「POSIX エラー」が表示される
TA23024 iSync 2: 電話の同期設定時の“iSync Agent”エラー
TS2189 iSync:Mac OS X 10.4.9 以降で Bluetooth を使って電話を同期すると、エラーメッセージが表示される
TA44621 iTunes 2: Error-50” Alert Appears When Burning a CD
TA44582 iTunes 2:「エラー -208 iTunes Music Library を開けません」警告メッセージ
TA38240 iTunes 4.8: iTunes Music Store にアクセスしたときに「エラー 400」が生じる
TS2191 iTunes 4:「ムービーファイルが見つかりません」エラーメッセージ
TA23517 iTunes 5 for Windows のインストール時のエラー 1920
TA38331 iTunes 6: iTunes Music Store コンテンツの再生中に -208 エラーメッセージが表示される
TA38482 iTunes 7 for Windows: 不明のエラーにより iTunes を起動できない
TS1927 iTunes 7 またはそれ以降で iPod をアップデートまたは復元する際にエラー 1413 が発生する
TS1372 iTunes 7 以降で iPod を復元またはアップデートすると、エラー 1415、1417、1418、1428、1429、1430、1436 または 1439 が発生する
TA25074 iTunes 7.5 を開いたときの“Some of the required files are missing”エラー、または QuickTime Player を開いた場合の“-2093”エラー
TS2654 iTunes 8.1 にアップデート後、 iPhone または iPod touch のカレンダー同期エラーメッセージが表示される
TS2277 iTunes 8:AirTunes 搭載の AirMac Express に接続したデバイスにミュージックをストリーミングすると「不明なエラー - 15000」が発生する
TS2280 iTunes 8:Windows Vista に iPhone または iPod を接続すると、ブルー画面にエラーメッセージが表示される場合
TS1475 iTunes Store から曲をダウンロードする際にエラーが発生する
TS1811 iTunes Store での購入を認めようとすると、iTunes for Mac がエラー -50 を報告する
TS2799 iTunes Store でエラー -3259 が表示される
TS2753 iTunes Store に接続すると、不明なエラー/警告メッセージが表示される
TS2373 iTunes Store: OxFFFE7958 error when downloading purchased video
TS2343 iTunes Store:エラー - 42023
TS1597 iTunes Store:ムービーレンタルのダウンロード時にエラー 3001、-42110、または 5103 が表示される
TS1583 iTunes Store:購入したコンテンツをダウンロードする際にエラー (-50) が生じる
TA38535 iTunes displays (-50) error when using iPod shuffle (Second Generation) with Windows 2000
304893-ja iTunes for Mac と iPod の同期中に“-48 エラー”が生じる
TS1478 iTunes for Mac と iPod の同期中に“-48 エラー”が起こる
HT1412 iTunes for Mac:可能性のある iTunes Store のエラー
TA38651 iTunes for Windows Vista: Distorted photos on device after syncing or blue screen error message on computer
TA38097 iTunes for Windows のインストールがエラー 1607 で終了する、または製品情報のパブリッシュ中に終了する
TS2294 iTunes for Windows または QuickTime for Windows のインストール時にエラー 1406 または 1402 が表示される
93447-ja iTunes for Windows: iTunes Music Store にアクセスすると (-50) または (403) のエラーが発生する
TS1485 iTunes for Windows: iTunes Music Store にアクセスすると、-3221 エラーが表示される
TA23179 iTunes for Windows: iTunes Music Store へのアクセス時のエラー -9812
TS1279 iTunes for Windows: 購入した曲のダウンロード時にエラー -39 が発生する
TS1424 iTunes for Windows:可能性のある iTunes Store のエラーについて
TA38633 iTunes で iPhone または iPod touch を復元するときのエラー 1601 または 1602
TA38603 iTunes で iPhone を復元するときのエラー 1603
TS2615 iTunes で、購入したコンテンツをダウンロードしようとすると、エラー 8248 が生じる
TS2384 iTunes で購入したビデオをダウンロードするとエラー 8008 が生じる
HT1210 iTunes と iPod をシンクすると -69 エラーを表示する
TS1259 iTunes: Error -23 when transferring Nike + iPod data from iPod nano
TS1276 iTunes: iTunes Store - コンピュータの日付が間違っている場合に起こり得るエラー:-9800、-9815 または -9814
TS2529 iTunes:“コンピュータにバックアップを保存できなかった”というエラーメッセージ
TS1492 iTunes:iTunes Store への接続時または iPhone のアクティベーション時のエラー 11333 について
TS2554 iWeb 09:コメントに添付ファイルを追加すると「404 エラー」ページが表示される
303789-ja iWeb 1.1:「.Mac に公開」を実行するとエラーが発生する
303306-ja iWeb: .Mac への公開時に“iDisk の割り当て容量の読み込み中にエラーが起きました”が表示される
TA23960 iWeb: ネットワークのタイムアウトにより“公開エラー”メッセージが表示される
TS1763 iWeb:MobileMe に公開されているブログにコメントを追加する、またはコメントを削除しようとすると、「このエントリはなくなりました」というエラーが表示される
TS2167 iWeb:公開後に一部の Web サーバで発生するエラー
TS2674 iWork.com:「書類のアップロード時にエラーが起きました」ダイアログが表示される
TA22747 「Apple Hardware Test for Power Mac」バージョン 2.2.5 でファンエラーが報告される
TA38211 「iPod をロックできません」エラーメッセージに対処する方法
TA32232 インターネット: BinHex 変換エラー
TA22517 ディスクユーティリティや fsck で報告される“エクステントアロケーションが重複しています”エラー
HT2041 ファイルをダウンロードする際の一般的なエラーメッセージ
TS1975 プリンタを追加した際に「選択したプリンタの追加時にエラーが発生しました」というメッセージが表示される
TA23506 一部の Xsan 構成で Compressor の分散処理を実行したときにエラーが生じる
TS1875 互換性モードで QuickTime for Windows を開くときのエラー -2096 メッセージ
86759-ja 外部 HTML テンプレートを使うと、.Mac HomePage に「文字セットがサポートされていません」というエラーが発生する
TS1566 購入したビデオをダウンロードする際にエラーが生じる
118445-ja *Mac OS: ランチャーを起動する際の“-39”または“-192”エラー